BDBM50016041 (1-Benzyl-4-{1-[2-(1-benzylcarbamoyl-3-methyl-butylcarbamoyl)-1-hydroxy-ethyl]-3-methyl-butylcarbamoyl}-butyl)-carbamic acid tert-butyl ester : (0.2 chloroform)::CHEMBL167204
SMILES CC(C)C[C@H](NC(=O)CCC[C@H](Cc1ccccc1)NC(=O)OC(C)(C)C)C(O)CC(=O)N[C@@H](CC(C)C)C(=O)NCc1ccccc1
InChI Key InChIKey=NTIKUUZBRPMLQJ-XLEWBJRTSA-N
Data  1 IC50
  Tab Delimited (TSV)   2D SDfile   Computed 3D by Vconf -m prep SDfile
Find this compound or compounds like it in BindingDB:
Activity Spreadsheet -- Enzyme Inhibition Constant Data from BindingDB
Found 1 hit for monomerid = 50016041
TargetRenin(Homo sapiens (Human))
Warner-Lambert
Curated by ChEMBL
LigandPNGBDBM50016041((1-Benzyl-4-{1-[2-(1-benzylcarbamoyl-3-methyl-buty...)
Affinity DataIC50:  2.30E+4nM. Assay description: Inhibitory activity against human renin
In DepthDetails ArticlePubMed