BDBM50016063 CHEMBL169023::{1-Benzyl-2-[(1-{1-[2-(1-benzylcarbamoyl-3-methyl-butylcarbamoyl)-1-hydroxy-ethyl]-3-methyl-butylcarbamoyl}-2-phenyl-ethyl)-hydroxy-amino]-ethyl}-carbamic acid tert-butyl ester : (1.0 butyric acid)
SMILES CC(C)C[C@H](NC(=O)[C@H](Cc1ccccc1)N(O)C[C@H](Cc1ccccc1)NC(=O)OC(C)(C)C)C(O)CC(=O)N[C@@H](CC(C)C)C(=O)NCc1ccccc1
InChI Key InChIKey=LMDMKIIAUKJWCN-IQDIPSPMSA-N
Data  1 IC50
  Tab Delimited (TSV)   2D SDfile   Computed 3D by Vconf -m prep SDfile
Find this compound or compounds like it in BindingDB:
Activity Spreadsheet -- Enzyme Inhibition Constant Data from BindingDB
Found 1 hit for monomerid = 50016063
TargetRenin(Homo sapiens (Human))
Warner-Lambert
Curated by ChEMBL
LigandPNGBDBM50016063(CHEMBL169023 | {1-Benzyl-2-[(1-{1-[2-(1-benzylcarb...)
Affinity DataIC50:  1.80E+4nM. Assay description: Inhibitory activity against human renin
In DepthDetails ArticlePubMed