BDBM50016447 CHEMBL3265064
SMILES CCCN(CC[C@@]1(O)C[C@@H](C1)NC(=O)c1ccc2ccccc2c1)[C@H]1C[C@@H]1c1ccccc1Cl
InChI Key InChIKey=HUIZNJVXOSCZJU-UXLOVFDUSA-N
Data  3 KI
  Tab Delimited (TSV)   2D SDfile   Computed 3D by Vconf -m prep SDfile
Find this compound or compounds like it in BindingDB:
Activity Spreadsheet -- Enzyme Inhibition Constant Data from BindingDB
Found 3 hits for monomerid = 50016447
TargetD(3) dopamine receptor(Rattus norvegicus (Rat))
University Of Michigan
Curated by ChEMBL
LigandPNGBDBM50016447(CHEMBL3265064)
Affinity DataKi:  19nM. Assay description: Displacement of [3H]R-(+)-7-OHDPAT from dopamine D3 receptor in Sprague-Dawley rat ventral striatum after 90 mins
In DepthDetails ArticlePubMed
TargetD(3) dopamine receptor(Homo sapiens (Human))
University Of Michigan
Curated by ChEMBL
LigandPNGBDBM50016447(CHEMBL3265064)
Affinity DataKi:  22nM. Assay description: Displacement of [3H]N-methylspiperone from human dopamine D3 receptor expressed in HEK293 cells after 1 hr by liquid scintillation counting analysis
In DepthDetails ArticlePubMed
TargetD(2) dopamine receptor(Homo sapiens (Human))
University Of Michigan
Curated by ChEMBL
LigandPNGBDBM50016447(CHEMBL3265064)
Affinity DataKi:  923nM. Assay description: Displacement of [3H]N-methylspiperone from human dopamine D2 receptor expressed in HEK293 cells after 1 hr by liquid scintillation counting analysis
In DepthDetails ArticlePubMed