BDBM50016463 CHEMBL3265066
SMILES CCCN(CC[C@@]1(O)C[C@@H](C1)NC(=O)c1ccc2ccccc2c1)[C@H]1C[C@@H]1c1ccc(Cl)cc1
InChI Key InChIKey=KIRKSXHWZHQUBF-DIBLIPFTSA-N
Data  1 KI
  Tab Delimited (TSV)   2D SDfile   Computed 3D by Vconf -m prep SDfile
Find this compound or compounds like it in BindingDB:
Activity Spreadsheet -- Enzyme Inhibition Constant Data from BindingDB
Found 1 hit for monomerid = 50016463
TargetD(3) dopamine receptor(Rattus norvegicus (Rat))
University Of Michigan
Curated by ChEMBL
LigandPNGBDBM50016463(CHEMBL3265066)
Affinity DataKi:  457nM. Assay description: Displacement of [3H]R-(+)-7-OHDPAT from dopamine D3 receptor in Sprague-Dawley rat ventral striatum after 90 mins
In DepthDetails ArticlePubMed