BDBM50016596 (Benzoyl-p-tolyl-amino)-acetic acid::CHEMBL275007
SMILES Cc1ccc(cc1)N(CC(O)=O)C(=O)c1ccccc1
InChI Key InChIKey=IZBVPKXZYVQSFQ-UHFFFAOYSA-N
Data  1 IC50
  Tab Delimited (TSV)   2D SDfile   Computed 3D by Vconf -m prep SDfile
Find this compound or compounds like it in BindingDB:
Activity Spreadsheet -- Enzyme Inhibition Constant Data from BindingDB
Found 1 hit for monomerid = 50016596
TargetAldo-keto reductase family 1 member B1(Rattus norvegicus)
Auburn University
Curated by ChEMBL
LigandPNGBDBM50016596((Benzoyl-p-tolyl-amino)-acetic acid | CHEMBL275007)
Affinity DataIC50:  3.00E+3nM. Assay description: Inhibition of aldose reductase from rat lens. Value ranges from 0.5 - 16
In DepthDetails ArticlePubMed