BDBM50016619 (Benzoyl-naphthalen-2-yl-amino)-acetic acid::CHEMBL8167
SMILES OC(=O)CN(C(=O)c1ccccc1)c1ccc2ccccc2c1
InChI Key InChIKey=NYRWHYKGEDLCFE-UHFFFAOYSA-N
Data  1 IC50
  Tab Delimited (TSV)   2D SDfile   Computed 3D by Vconf -m prep SDfile
Find this compound or compounds like it in BindingDB:
Activity Spreadsheet -- Enzyme Inhibition Constant Data from BindingDB
Found 1 hit for monomerid = 50016619
TargetAldo-keto reductase family 1 member B1(Rattus norvegicus)
Auburn University
Curated by ChEMBL
LigandPNGBDBM50016619((Benzoyl-naphthalen-2-yl-amino)-acetic acid | CHEM...)
Affinity DataIC50:  2.20E+5nM. Assay description: Inhibition of aldose reductase from rat lens. Value ranges from 40 - 680
In DepthDetails ArticlePubMed