BDBM50016757 1-[20-Benzyl-14-carbamoylmethyl-23-(4-ethoxy-benzyl)-17-isopropyl-13,16,19,22,25-pentaoxo-7,9-dithia-12,15,18,21,24-pentaaza-spiro[5.20]hexacosane-11-carbonyl]-pyrrolidine-2-carboxylic acid (1-carbamoyl-4-guanidino-butyl)-amide::CHEMBL2370646
SMILES [#6]-[#6]-[#8]-c1ccc(-[#6]-[#6@H]-2-[#7]-[#6](=O)-[#6]C3([#6]-[#6]-[#6]-[#6]-[#6]3)[#16]-[#6]-[#16]-[#6]-[#6@@H](-[#7]-[#6](=O)-[#6@@H](-[#6]-[#6](-[#7])=O)-[#7]-[#6](=O)-[#6@@H](-[#7]-[#6](=O)-[#6@@H](-[#6]-c3ccccc3)-[#7]-[#6]-2=O)-[#6](-[#6])-[#6])-[#6](=O)-[#7]-2-[#6]-[#6]-[#6]-[#6@H]-2-[#6](=O)-[#7]-[#6@@H](-[#6]-[#6]-[#6]\[#7]=[#6](/[#7])-[#7])-[#6](-[#7])=O)cc1
InChI Key InChIKey=NRNNNNZZQZCNND-OOFXSPGDSA-N
Data  2 KI
  Tab Delimited (TSV)   2D SDfile   Computed 3D by Vconf -m prep SDfile
Find this compound or compounds like it in BindingDB:
Activity Spreadsheet -- Enzyme Inhibition Constant Data from BindingDB
Found 2 hits for monomerid = 50016757
TargetVasopressin V2 receptor(Sus scrofa)
Smith Kline & French Laboratories
Curated by ChEMBL
LigandPNGBDBM50016757(1-[20-Benzyl-14-carbamoylmethyl-23-(4-ethoxy-benzy...)
Affinity DataKi:  4.40nM. Assay description: Inhibition constant for vasopressin-stimulated adenylate cyclase of medullary membranes of pig kidney
In DepthDetails ArticlePubMed
TargetVasopressin V2 receptor(Homo sapiens (Human))
Smith Kline & French Laboratories
Curated by ChEMBL
LigandPNGBDBM50016757(1-[20-Benzyl-14-carbamoylmethyl-23-(4-ethoxy-benzy...)
Affinity DataKi:  4.40nM. Assay description: Inhibition constant for vasopressin-stimulated adenylate cyclase of medullary membranes of human kidney
In DepthDetails ArticlePubMed