BDBM50016965 4,4-Dimethyl-1-{4-[4-(2-methyl-furo[3,2-c]pyridin-4-yl)-piperazin-1-yl]-butyl}-piperidine-2,6-dione; hydrochloride::CHEMBL544202
SMILES Cc1cc2c(nccc2o1)N1CCN(CCCCN2C(=O)CC(C)(C)CC2=O)CC1
InChI Key InChIKey=RLIZPUXPCGFMOI-UHFFFAOYSA-N
Data  2 IC50
  Tab Delimited (TSV)   2D SDfile   Computed 3D by Vconf -m prep SDfile
Find this compound or compounds like it in BindingDB:
Activity Spreadsheet -- Enzyme Inhibition Constant Data from BindingDB
Found 2 hits for monomerid = 50016965
TargetD(2) dopamine receptor(Rattus norvegicus (rat))
Bristol-Myers
Curated by ChEMBL
LigandPNGBDBM50016965(4,4-Dimethyl-1-{4-[4-(2-methyl-furo[3,2-c]pyridin-...)
Affinity DataIC50:  708nM. Assay description: Ability to bind at Dopamine receptor D2 of rat corpus striatum by displacing [3H]spiperone
In DepthDetails ArticlePubMed
Target5-hydroxytryptamine receptor 1A(Rattus norvegicus (rat))
Bristol-Myers
Curated by ChEMBL
LigandPNGBDBM50016965(4,4-Dimethyl-1-{4-[4-(2-methyl-furo[3,2-c]pyridin-...)
Affinity DataIC50:  4.90nM. Assay description: Ability to bind at serotonin 5-hydroxytryptamine 1A receptors of rat hippocampus by displacing [3H]8-OH-DPAT
In DepthDetails ArticlePubMed