BDBM50016971 3-{4-[4-(2-Methyl-furo[3,2-c]pyridin-4-yl)-piperazin-1-yl]-butyl}-1-thia-3-aza-spiro[4.4]nonane-2,4-dione; hydrochloride::CHEMBL536797
SMILES Cc1cc2c(nccc2o1)N1CCN(CCCCN2C(=O)SC3(CCCC3)C2=O)CC1
InChI Key InChIKey=XKTCRHODWQUSIJ-UHFFFAOYSA-N
Data  3 IC50
  Tab Delimited (TSV)   2D SDfile   Computed 3D by Vconf -m prep SDfile
Find this compound or compounds like it in BindingDB:
Activity Spreadsheet -- Enzyme Inhibition Constant Data from BindingDB
Found 3 hits for monomerid = 50016971
TargetAlpha-1A/Alpha-1B/Alpha-1D adrenergic receptor(Rattus norvegicus (rat))
Bristol-Myers
Curated by ChEMBL
LigandPNGBDBM50016971(3-{4-[4-(2-Methyl-furo[3,2-c]pyridin-4-yl)-piperaz...)
Affinity DataIC50:  28nM. Assay description: Ability to bind at Alpha-1 adrenergic receptor by displacing [3H]WB-4101
In DepthDetails ArticlePubMed
Target5-hydroxytryptamine receptor 1A(Rattus norvegicus (rat))
Bristol-Myers
Curated by ChEMBL
LigandPNGBDBM50016971(3-{4-[4-(2-Methyl-furo[3,2-c]pyridin-4-yl)-piperaz...)
Affinity DataIC50:  2.20nM. Assay description: Ability to bind at 5-hydroxytryptamine 1A receptor of rat hippocampus by displacing [3H]8-OH-DPAT
In DepthDetails ArticlePubMed
TargetD(2) dopamine receptor(Rattus norvegicus (rat))
Bristol-Myers
Curated by ChEMBL
LigandPNGBDBM50016971(3-{4-[4-(2-Methyl-furo[3,2-c]pyridin-4-yl)-piperaz...)
Affinity DataIC50:  751nM. Assay description: Ability to bind at dopamine receptor D2 of rat corpus striatum by displacing [3H]spiperone
In DepthDetails ArticlePubMed