BDBM50017458 2-Piperazin-1-yl-benzonitrile::CHEMBL275943
SMILES N#Cc1ccccc1N1CCNCC1
InChI Key InChIKey=FRICBZWJFIRJOB-UHFFFAOYSA-N
Data  7 KI
  Tab Delimited (TSV)   2D SDfile   Computed 3D by Vconf -m prep SDfile
Find this compound or compounds like it in BindingDB:
Activity Spreadsheet -- Enzyme Inhibition Constant Data from BindingDB
Found 7 hits for monomerid = 50017458
Target5-hydroxytryptamine receptor 1B(Rattus norvegicus (Rat))
Mcneil Pharmaceutical And Janssen Research Foundation Worldwide
Curated by ChEMBL
LigandPNGBDBM50017458(2-Piperazin-1-yl-benzonitrile | CHEMBL275943)
Affinity DataKi:  22nM. Assay description: Binding affinity at rat 5-hydroxytryptamine 1B receptor by [3H]-5-HT displacement.
In DepthDetails ArticlePubMed
Target5-hydroxytryptamine receptor 1A/1B/1D/1F(RAT)
Mcneil Pharmaceutical And Janssen Research Foundation Worldwide
Curated by ChEMBL
LigandPNGBDBM50017458(2-Piperazin-1-yl-benzonitrile | CHEMBL275943)
Affinity DataKi:  26nM. Assay description: Inhibition of [3H]5-HT radioligand binding against 5-hydroxytryptamine 1 receptor
In DepthDetails ArticlePubMed
Target5-hydroxytryptamine receptor 1A(Rattus norvegicus (rat))
Mcneil Pharmaceutical And Janssen Research Foundation Worldwide
Curated by ChEMBL
LigandPNGBDBM50017458(2-Piperazin-1-yl-benzonitrile | CHEMBL275943)
Affinity DataKi:  26nM. Assay description: Binding affinity at rat 5-hydroxytryptamine 1A receptor by [3H]-WB-4101 displacement.
In DepthDetails ArticlePubMed
TargetAlpha-1A/Alpha-1B/Alpha-1D adrenergic receptor(Rattus norvegicus (rat))
Mcneil Pharmaceutical And Janssen Research Foundation Worldwide
Curated by ChEMBL
LigandPNGBDBM50017458(2-Piperazin-1-yl-benzonitrile | CHEMBL275943)
Affinity DataKi:  214nM. Assay description: Binding affinity against rat Alpha-1 adrenergic receptor.
In DepthDetails ArticlePubMed
TargetD(1A) dopamine receptor(RAT)
Mcneil Pharmaceutical And Janssen Research Foundation Worldwide
Curated by ChEMBL
LigandPNGBDBM50017458(2-Piperazin-1-yl-benzonitrile | CHEMBL275943)
Affinity DataKi: >1.00E+3nM. Assay description: Binding affinity at rat Dopamine receptor D1 by [3H]-SCH-23,390 displacement.
In DepthDetails ArticlePubMed
TargetD(2) dopamine receptor(Rattus norvegicus (rat))
Mcneil Pharmaceutical And Janssen Research Foundation Worldwide
Curated by ChEMBL
LigandPNGBDBM50017458(2-Piperazin-1-yl-benzonitrile | CHEMBL275943)
Affinity DataKi: >1.00E+3nM. Assay description: Binding affinity against rat Dopamine receptor D2.
In DepthDetails ArticlePubMed
TargetSerotonin 2 (5-HT2) receptor(RAT)
Mcneil Pharmaceutical And Janssen Research Foundation Worldwide
Curated by ChEMBL
LigandPNGBDBM50017458(2-Piperazin-1-yl-benzonitrile | CHEMBL275943)
Affinity DataKi: >1.00E+3nM. Assay description: Binding affinity at rat 5-hydroxytryptamine 2 receptor by [3H]ketanserin displacement.
In DepthDetails ArticlePubMed