BDBM50017888 CHEMBL3289010
SMILES FC(F)(F)c1ccnc(Nc2ccc3NC(=O)CCCc3c2)c1
InChI Key InChIKey=AEJVAOFVEOOROV-UHFFFAOYSA-N
Data  1 IC50
  Tab Delimited (TSV)   2D SDfile   Computed 3D by Vconf -m prep SDfile
Find this compound or compounds like it in BindingDB:
Activity Spreadsheet -- Enzyme Inhibition Constant Data from BindingDB
Found 1 hit for monomerid = 50017888
TargetKinesin-like protein KIF11(Homo sapiens (Human))
Kyoto University
Curated by ChEMBL
LigandPNGBDBM50017888(CHEMBL3289010)
Affinity DataIC50:  50nM. Assay description: Inhibition of C-terminal His-tagged KSP ATPase motor domain (unknown origin) expressed in bacteria incubated for 30 mins prior to ATP addition measur...
In DepthDetails ArticlePubMed