BDBM50018682 CHEMBL3291295
SMILES CCCCCCC#Cc1nc(N)c2ncn(CC=C)c2n1
InChI Key InChIKey=GLADWVNGMJZLNA-UHFFFAOYSA-N
Data  1 IC50
  Tab Delimited (TSV)   2D SDfile   Computed 3D by Vconf -m prep SDfile
Find this compound or compounds like it in BindingDB:
Activity Spreadsheet -- Enzyme Inhibition Constant Data from BindingDB
Found 1 hit for monomerid = 50018682
TargetAdenosine receptor A2a(Rattus norvegicus (rat))
Yamasa
Curated by ChEMBL
LigandPNGBDBM50018682(CHEMBL3291295)
Affinity DataIC50: >1.00E+4nM. Assay description: Antagonist activity at adenosine A2A receptor in 5-HT-treated Wistar rat femoral vein assessed as inhibition of 2-octyn-1-yladenosine-induced vasodil...
In DepthDetails ArticlePubMed