BDBM50019178 CHEMBL70883::{5-(2-Fluoro-phenyl)-3-[(1H-indole-2-carbonyl)-amino]-2-oxo-2,3-dihydro-benzo[e][1,4]diazepin-1-yl}-acetic acid ethyl ester: 0.1C4H10O
SMILES CCOC(=O)CN1c2ccccc2C(=NC(NC(=O)c2cc3ccccc3[nH]2)C1=O)c1ccccc1F
InChI Key InChIKey=ATZKJWWUDVCPPQ-UHFFFAOYSA-N
Data  3 IC50
  Tab Delimited (TSV)   2D SDfile   Computed 3D by Vconf -m prep SDfile
Find this compound or compounds like it in BindingDB:
Activity Spreadsheet -- Enzyme Inhibition Constant Data from BindingDB
Found 3 hits for monomerid = 50019178
TargetCholecystokinin receptor type A(RAT)
Merck Sharp & Dohme Research Laboratories
Curated by ChEMBL
LigandPNGBDBM50019178(CHEMBL70883 | {5-(2-Fluoro-phenyl)-3-[(1H-indole-2...)
Affinity DataIC50:  3nM. Assay description: Half-maximal inhibition of [125I]CCK-8 binding to cholecystokinin receptor from rat pancreatic tissue
In DepthDetails ArticlePubMed
TargetCholecystokinin receptor type A/Gastrin/cholecystokinin type B receptor(Homo sapiens (Human))
Merck Sharp & Dohme Research Laboratories
Curated by ChEMBL
LigandPNGBDBM50019178(CHEMBL70883 | {5-(2-Fluoro-phenyl)-3-[(1H-indole-2...)
Affinity DataIC50:  200nM. Assay description: Half-maximal inhibition of [125I]-CCK-8(+) binding to cholecystokinin receptor from guinea pig brain tissue
In DepthDetails ArticlePubMed
TargetGastrin/cholecystokinin type B receptor(Homo sapiens (Human))
Merck Sharp & Dohme Research Laboratories
Curated by ChEMBL
LigandPNGBDBM50019178(CHEMBL70883 | {5-(2-Fluoro-phenyl)-3-[(1H-indole-2...)
Affinity DataIC50:  120nM. Assay description: Half-maximal inhibition of [125I]gastrin binding to guinea pig gastric glands
In DepthDetails ArticlePubMed