BDBM50019191 1-Methyl-1H-indole-2-carboxylic acid (1-methyl-2-oxo-5-phenyl-2,3-dihydro-1H-benzo[e][1,4]diazepin-3-yl)-amide::CHEMBL71079
SMILES CN1c2ccccc2C(=NC(NC(=O)c2cc3ccccc3n2C)C1=O)c1ccccc1
InChI Key InChIKey=LORMCGPDRBOOEU-UHFFFAOYSA-N
Data  7 IC50
  Tab Delimited (TSV)   2D SDfile   Computed 3D by Vconf -m prep SDfile
Find this compound or compounds like it in BindingDB:
Activity Spreadsheet -- Enzyme Inhibition Constant Data from BindingDB
Found 7 hits for monomerid = 50019191
TargetGastrin/cholecystokinin type B receptor(Homo sapiens (Human))
TBA
Curated by ChEMBL
LigandPNGBDBM50019191(1-Methyl-1H-indole-2-carboxylic acid (1-methyl-2-o...)
Affinity DataIC50:  1.50E+4nM. Assay description: Tested for its activity to inhibit the binding of [125I]-CCK-33 to Cholecystokinin type B receptor in guinea pig brain
In DepthDetails Article
TargetCholecystokinin receptor type A(RAT)
TBA
Curated by ChEMBL
LigandPNGBDBM50019191(1-Methyl-1H-indole-2-carboxylic acid (1-methyl-2-o...)
Affinity DataIC50:  1.40nM. Assay description: Tested for its activity to inhibit the binding of [125I]-CCK-33 to Cholecystokinin type A receptor in rat pancreas
In DepthDetails Article
TargetCholecystokinin receptor type A(RAT)
TBA
Curated by ChEMBL
LigandPNGBDBM50019191(1-Methyl-1H-indole-2-carboxylic acid (1-methyl-2-o...)
Affinity DataIC50:  1.40nM. Assay description: Half-maximal inhibition of [125I]CCK-33 binding to cholecystokinin A receptor from rat pancreatic tissue
In DepthDetails ArticlePubMed
TargetGastrin/cholecystokinin type B receptor(Homo sapiens (Human))
TBA
Curated by ChEMBL
LigandPNGBDBM50019191(1-Methyl-1H-indole-2-carboxylic acid (1-methyl-2-o...)
Affinity DataIC50:  2.00E+3nM. Assay description: Tested for its activity to inhibit the binding of [125I]-gastrin to gastric glands (gastrin) in guinea pig
In DepthDetails Article
TargetCholecystokinin receptor type A(RAT)
TBA
Curated by ChEMBL
LigandPNGBDBM50019191(1-Methyl-1H-indole-2-carboxylic acid (1-methyl-2-o...)
Affinity DataIC50:  1.41nM. Assay description: Binding affinity against cholecystokinin type A receptor of rat pancreas
In DepthDetails ArticlePubMed
TargetCholecystokinin receptor type A/Gastrin/cholecystokinin type B receptor(Homo sapiens (Human))
Merck Sharp & Dohme Research Laboratories
Curated by ChEMBL
LigandPNGBDBM50019191(1-Methyl-1H-indole-2-carboxylic acid (1-methyl-2-o...)
Affinity DataIC50:  1.50E+4nM. Assay description: Half-maximal inhibition of [125I]-CCK-8(+) binding to cholecystokinin receptor from guinea pig brain tissue
In DepthDetails ArticlePubMed
TargetGastrin/cholecystokinin type B receptor(Homo sapiens (Human))
TBA
Curated by ChEMBL
LigandPNGBDBM50019191(1-Methyl-1H-indole-2-carboxylic acid (1-methyl-2-o...)
Affinity DataIC50:  2.00E+3nM. Assay description: Half-maximal inhibition of [125I]gastrin binding to guinea pig gastric glands
In DepthDetails ArticlePubMed