BDBM500192 US11021467, Compound 49
SMILES Cc1nc(N)nc(N[C@@H](C2CC2)c2nc3cccc(Cl)c3c(=O)n2CCCN)c1C#N
InChI Key InChIKey=ZQTOIAUDKJDPEL-KRWDZBQOSA-N
Data  3 IC50
  Tab Delimited (TSV)   2D SDfile   Computed 3D by Vconf -m prep SDfile
Find this compound or compounds like it in BindingDB:
Activity Spreadsheet -- Enzyme Inhibition Constant Data from BindingDB
Found 3 hits for monomerid = 500192
TargetPhosphatidylinositol 3-kinase regulatory subunit beta(Homo sapiens (Human))
Gilead Sciences
US Patent
LigandPNGBDBM500192(US11021467, Compound 49)
Affinity DataIC50:  1nM. Assay description: Class I PI3K isoforms were expressed and purified as heterodimeric recombinant proteins. All assay reagents and buffers for the TR-FRET assay were pu...
Ligand InfoPC cidPC sid
In DepthDetails US Patent
TargetPhosphatidylinositol 4,5-bisphosphate 3-kinase catalytic subunit gamma isoform(Homo sapiens (Human))
Gilead Sciences
US Patent
LigandPNGBDBM500192(US11021467, Compound 49)
Affinity DataIC50:  750nM. Assay description: Class I PI3K isoforms were expressed and purified as heterodimeric recombinant proteins. All assay reagents and buffers for the TR-FRET assay were pu...
Ligand InfoPC cidPC sid
In DepthDetails US Patent
TargetPhosphatidylinositol 4,5-bisphosphate 3-kinase catalytic subunit delta isoform(Homo sapiens (Human))
Gilead Sciences
US Patent
LigandPNGBDBM500192(US11021467, Compound 49)
Affinity DataIC50:  1nM. Assay description: Class I PI3K isoforms were expressed and purified as heterodimeric recombinant proteins. All assay reagents and buffers for the TR-FRET assay were pu...
Ligand InfoPC cidPC sid
In DepthDetails US Patent