BDBM50019252 1H-Indole-2-carboxylic acid (2-oxo-5-phenyl-2,3-dihydro-1H-benzo[e][1,4]diazepin-3-yl)-amide::1H-Indole-2-carboxylic acid (2-oxo-5-phenyl-2,3-dihydro-1H-benzo[e][1,4]diazepin-3-yl)-amide: 0.2C4H10O::CCK antagonist synthetic 14::CHEMBL306760
SMILES O=C(NC1N=C(c2ccccc2)c2ccccc2NC1=O)c1cc2ccccc2[nH]1
InChI Key InChIKey=PQCDUNADCLPZMS-UHFFFAOYSA-N
Data  2 KI  6 IC50
  Tab Delimited (TSV)   2D SDfile   Computed 3D by Vconf -m prep SDfile
Find this compound or compounds like it in BindingDB:
Activity Spreadsheet -- Enzyme Inhibition Constant Data from BindingDB
Found 8 hits for monomerid = 50019252
TargetCholecystokinin(RAT)
Merck Sharp & Dohme Research Laboratories
Curated by PDSP Ki Database
LigandPNGBDBM50019252(1H-Indole-2-carboxylic acid (2-oxo-5-phenyl-2,3-di...)
Affinity DataKi:  4.70nM
In DepthDetails ArticlePubMed
TargetGamma-aminobutyric acid receptor subunit alpha-1(Rattus norvegicus (Rat))
Merck Sharp & Dohme Research Laboratories
Curated by PDSP Ki Database
LigandPNGBDBM50019252(1H-Indole-2-carboxylic acid (2-oxo-5-phenyl-2,3-di...)
Affinity DataKi: >1.00E+4nM
In DepthDetails ArticlePubMed
TargetCholecystokinin receptor type A(RAT)
University Of Illinois At Chicago
Curated by ChEMBL
LigandPNGBDBM50019252(1H-Indole-2-carboxylic acid (2-oxo-5-phenyl-2,3-di...)
Affinity DataIC50:  4.57nM. Assay description: Binding affinity against cholecystokinin type A receptor of rat pancreas
In DepthDetails ArticlePubMed
TargetCholecystokinin receptor type A/Gastrin/cholecystokinin type B receptor(Homo sapiens (Human))
Merck Sharp & Dohme Research Laboratories
Curated by ChEMBL
LigandPNGBDBM50019252(1H-Indole-2-carboxylic acid (2-oxo-5-phenyl-2,3-di...)
Affinity DataIC50:  8.00E+3nM. Assay description: Half-maximal inhibition of [125I]-CCK-8(+) binding to cholecystokinin receptor from guinea pig brain tissue
In DepthDetails ArticlePubMed
TargetcGMP-inhibited 3',5'-cyclic phosphodiesterase 3A/3B(Homo sapiens (Human))
Institut De Recherche Jouveinal-Parke Davis
Curated by ChEMBL
LigandPNGBDBM50019252(1H-Indole-2-carboxylic acid (2-oxo-5-phenyl-2,3-di...)
Affinity DataIC50: >1.00E+5nM. Assay description: Inhibition of Phosphodiesterase 3 extracted from dog aorta smooth muscle cells by using radioligands [3H]cAMP or [3H]-cGMP.
In DepthDetails ArticlePubMed
TargetcAMP-specific 3',5'-cyclic phosphodiesterase 4A/4B/4C/4D(Homo sapiens (Human))
Institut De Recherche Jouveinal-Parke Davis
Curated by ChEMBL
LigandPNGBDBM50019252(1H-Indole-2-carboxylic acid (2-oxo-5-phenyl-2,3-di...)
Affinity DataIC50: >1.00E+5nM. Assay description: Inhibition of phosphodiesterase 4 extracted from human U937 cells by using radioligands [3H]-cAMP or [3H]cGMP.
In DepthDetails ArticlePubMed
TargetCholecystokinin receptor type A(RAT)
University Of Illinois At Chicago
Curated by ChEMBL
LigandPNGBDBM50019252(1H-Indole-2-carboxylic acid (2-oxo-5-phenyl-2,3-di...)
Affinity DataIC50:  4.70nM. Assay description: Half-maximal inhibition of [125I]CCK-33 binding to cholecystokinin A receptor from rat pancreatic tissue
In DepthDetails ArticlePubMed
TargetGastrin/cholecystokinin type B receptor(Homo sapiens (Human))
Merck Sharp & Dohme Research Laboratories
Curated by ChEMBL
LigandPNGBDBM50019252(1H-Indole-2-carboxylic acid (2-oxo-5-phenyl-2,3-di...)
Affinity DataIC50:  4.00E+3nM. Assay description: Half-maximal inhibition of [125I]gastrin binding to guinea pig gastric glands
In DepthDetails ArticlePubMed