BDBM50019293 1-(1-{3-[Bis-(4-fluoro-phenyl)-amino]-propyl}-piperidin-4-yl)-1,3-dihydro-benzoimidazol-2-one::1-(1-{3-[Bis-(4-fluoro-phenyl)-amino]-propyl}-piperidin-4-yl)-1,3-dihydro-benzoimidazol-2-one(Pimozide)::CHEMBL1423::cid_16362
SMILES Fc1ccc(cc1)N(CCCN1CCC(CC1)n1c2ccccc2[nH]c1=O)c1ccc(F)cc1
InChI Key InChIKey=WNRRQSNNNIIUDN-UHFFFAOYSA-N
Data  1 KI  4 IC50  1 Kd
  Tab Delimited (TSV)   2D SDfile   Computed 3D by Vconf -m prep SDfile
Find this compound or compounds like it in BindingDB:
Activity Spreadsheet -- Enzyme Inhibition Constant Data from BindingDB
Found 6 hits for monomerid = 50019293
TargetPotassium voltage-gated channel subfamily H member 2(Homo sapiens (Human))
Novo Nordisk
Curated by ChEMBL
LigandPNGBDBM50019293(1-(1-{3-[Bis-(4-fluoro-phenyl)-amino]-propyl}-pipe...)
Affinity DataKi:  42nM. Assay description: Displacement of [3H]Astemizole from hERG expressed in HEK293 cells at 10 uM
In DepthDetails ArticlePubMed
TargetX-box-binding protein 1(Homo sapiens (Human))
Emory University
Curated by PubChem BioAssay
LigandPNGBDBM50019293(1-(1-{3-[Bis-(4-fluoro-phenyl)-amino]-propyl}-pipe...)
Affinity DataIC50:  160nM. Assay description: NIH Molecular Libraries Screening Centers Network [MLSCN] Emory Chemical Biology Discovery Center in MLSCN Assay provider: Dr. Randal Kaufman, Univer...
In DepthDetails PCBioAssay
TargetD(2) dopamine receptor(Homo sapiens (Human))
Ewha Womans University
Curated by ChEMBL
LigandPNGBDBM50019293(1-(1-{3-[Bis-(4-fluoro-phenyl)-amino]-propyl}-pipe...)
Affinity DataKd:  29nM. Assay description: Inhibition of dopamine D2 receptor
In DepthDetails ArticlePubMed
TargetSodium channel protein type 2 subunit alpha(Rattus norvegicus)
Warner-Lambert
Curated by ChEMBL
LigandPNGBDBM50019293(1-(1-{3-[Bis-(4-fluoro-phenyl)-amino]-propyl}-pipe...)
Affinity DataIC50:  340nM. Assay description: Inhibitory activity against type IIA sodium channel in CNaIIA-1 cell line expressed in CHO cells
In DepthDetails ArticlePubMed
TargetDNA damage-inducible transcript 3 protein(Mus musculus)
Emory University
Curated by PubChem BioAssay
LigandPNGBDBM50019293(1-(1-{3-[Bis-(4-fluoro-phenyl)-amino]-propyl}-pipe...)
Affinity DataIC50: >1.00E+4nM. Assay description: NIH Molecular Libraries Screening Centers Network [MLSCN] Emory Chemical Biology Discovery Center in MLSCN Assay provider: Dr. Randal Kaufman, Univer...
In DepthDetails PCBioAssay
TargetDNA damage-inducible transcript 3 protein(Mus musculus)
Emory University
Curated by PubChem BioAssay
LigandPNGBDBM50019293(1-(1-{3-[Bis-(4-fluoro-phenyl)-amino]-propyl}-pipe...)
Affinity DataIC50: >1.00E+4nM. Assay description: NIH Molecular Libraries Screening Centers Network [MLSCN] Emory Chemical Biology Discovery Center in MLSCN Assay provider: Dr. Randal Kaufman, Univer...
In DepthDetails PCBioAssay