BDBM50019569 CHEMBL274400::D-Phe-Cys-Tyr--Trp-Lys-Thr-Pen-Thr-NH2
SMILES C[C@@H](O)[C@H](NC(=O)[C@@H]1NC(=O)[C@H](NC(=O)[C@H](CCCCN)NC(=O)[C@H](Cc2c[nH]c3ccccc23)NC(=O)[C@H](Cc2ccc(O)cc2)NC(=O)[C@H](CSSC1(C)C)NC(=O)[C@H](N)Cc1ccccc1)[C@@H](C)O)C(N)=O
InChI Key InChIKey=VSEYLDNPHYTJMJ-AVTOYXFISA-N
Data  2 IC50
  Tab Delimited (TSV)   2D SDfile   Computed 3D by Vconf -m prep SDfile
Find this compound or compounds like it in BindingDB:
Activity Spreadsheet -- Enzyme Inhibition Constant Data from BindingDB
Found 2 hits for monomerid = 50019569
TargetMu-type opioid receptor(Rattus norvegicus (rat))
TBA
Curated by ChEMBL
LigandPNGBDBM50019569(CHEMBL274400 | D-Phe-Cys-Tyr--Trp-Lys-Thr-Pen-Thr-...)
Affinity DataIC50:  1.35E+3nM. Assay description: Inhibition of binding of [3H]-naloxone to Opioid receptor mu 1 of rat brain membranes
In DepthDetails ArticlePubMed
TargetDelta-type opioid receptor(Rattus norvegicus (rat))
TBA
Curated by ChEMBL
LigandPNGBDBM50019569(CHEMBL274400 | D-Phe-Cys-Tyr--Trp-Lys-Thr-Pen-Thr-...)
Affinity DataIC50: >7.00E+4nM. Assay description: Inhibition of [3H]-DPDPE binding to Opioid receptor delta 1 of rat brain membranes
In DepthDetails ArticlePubMed