BDBM50019914 4-[(3-Bromo-phenyl)-imino-methyl]-2,5-dimethyl-2H-pyrazol-3-ol::CHEMBL3144748
SMILES Cc1[nH]n(C)c(=O)c1C(=N)c1cccc(Br)c1
InChI Key InChIKey=RGFNDQQWOWFIEC-UHFFFAOYSA-N
Data  1 IC50
  Tab Delimited (TSV)   2D SDfile   Computed 3D by Vconf -m prep SDfile
Find this compound or compounds like it in BindingDB:
Activity Spreadsheet -- Enzyme Inhibition Constant Data from BindingDB
Found 1 hit for monomerid = 50019914
TargetD(2) dopamine receptor(Rattus norvegicus (rat))
Warner-Lambert/Parke-Davis Pharmaceutical Research
Curated by ChEMBL
LigandPNGBDBM50019914(4-[(3-Bromo-phenyl)-imino-methyl]-2,5-dimethyl-2H-...)
Affinity DataIC50: >1.00E+4nM. Assay description: In vitro binding affinity against Dopamine receptor D2 by displacement of [3H]-haloperidol from rat striatal membranes.
In DepthDetails ArticlePubMed