BDBM50019916 2,2-Dichloro-N-[(3-chloro-phenyl)-(5-hydroxy-1,3-dimethyl-1H-pyrazol-4-yl)-methylene]-acetamide::CHEMBL3144642
SMILES Cc1[nH]n(C)c(=O)c1\C(=N\C(=O)C(Cl)Cl)c1cccc(Cl)c1
InChI Key InChIKey=SDBCYPPQUUWMKW-UHFFFAOYSA-N
Data  1 IC50
  Tab Delimited (TSV)   2D SDfile   Computed 3D by Vconf -m prep SDfile
Find this compound or compounds like it in BindingDB:
Activity Spreadsheet -- Enzyme Inhibition Constant Data from BindingDB
Found 1 hit for monomerid = 50019916
TargetD(2) dopamine receptor(Rattus norvegicus (rat))
Warner-Lambert/Parke-Davis Pharmaceutical Research
Curated by ChEMBL
LigandPNGBDBM50019916(2,2-Dichloro-N-[(3-chloro-phenyl)-(5-hydroxy-1,3-d...)
Affinity DataIC50: >1.00E+3nM. Assay description: In vitro binding affinity against Dopamine receptor D2 by displacement of [3H]-haloperidol from rat striatal membranes.
In DepthDetails ArticlePubMed