BDBM50020138 4-[4-(6'-Chloro-2,3,5,6-tetrahydro-[1,2']bipyrazinyl-4-yl)-butyl]-4-aza-tricyclo[5.3.2.0*2,6*]dodecane-3,5-dione;Hydrochloride::CHEMBL28026
SMILES Clc1cncc(n1)N1CCN(CCCCN2C(=O)C3C(C4CCC3CCC4)C2=O)CC1
InChI Key InChIKey=PDNABWPQIWNGPL-UHFFFAOYSA-N
Data  1 KI
  Tab Delimited (TSV)   2D SDfile   Computed 3D by Vconf -m prep SDfile
Find this compound or compounds like it in BindingDB:
Activity Spreadsheet -- Enzyme Inhibition Constant Data from BindingDB
Found 1 hit for monomerid = 50020138
Target5-hydroxytryptamine receptor 1A(Rattus norvegicus (rat))
Wyeth-Ayerst Research
Curated by ChEMBL
LigandPNGBDBM50020138(4-[4-(6'-Chloro-2,3,5,6-tetrahydro-[1,2']bipyrazin...)
Affinity DataKi:  162nM. Assay description: In vitro inhibition of [3H]spiperone binding to 5-hydroxytryptamine 1A receptor from rat hippocampal tissue.
In DepthDetails ArticlePubMed