BDBM50020206 CHEMBL266829::CTOP
SMILES C[C@@H](O)[C@H](NC(=O)[C@H]1NC(=O)[C@@H](NC(=O)[C@H](CCCCN)NC(=O)[C@H](CCCN)NC(=O)[C@H](Cc2ccc(O)cc2)NC(=O)[C@H](CSSC1(C)C)NC(=O)[C@@H](N)Cc1ccccc1)[C@@H](C)O)C(N)=O
InChI Key InChIKey=SXUHCJSDGDDHGY-RSDYCKIXSA-N
Data  3 IC50
  Tab Delimited (TSV)   2D SDfile   Computed 3D by Vconf -m prep SDfile
Find this compound or compounds like it in BindingDB:
Activity Spreadsheet -- Enzyme Inhibition Constant Data from BindingDB
Found 3 hits for monomerid = 50020206
TargetDelta-type opioid receptor(Rattus norvegicus (rat))
University Of Arizona
Curated by ChEMBL
LigandPNGBDBM50020206(CHEMBL266829 | CTOP)
Affinity DataIC50:  5.60E+3nM. Assay description: Binding affinity in competition with [3H]- DPDPE in Opioid receptor delta 1 binding to rat brain membrane
In DepthDetails ArticlePubMed
TargetSomatostatin receptor type 1/2/3/4/5(RAT)
University Of Arizona
Curated by ChEMBL
LigandPNGBDBM50020206(CHEMBL266829 | CTOP)
Affinity DataIC50:  4.77E+4nM. Assay description: Binding affinity in competition with [125I]- CGP-23996 in somatostatin receptor binding to rat brain membrane
In DepthDetails ArticlePubMed
TargetMu-type opioid receptor(Rattus norvegicus (rat))
University Of Arizona
Curated by ChEMBL
LigandPNGBDBM50020206(CHEMBL266829 | CTOP)
Affinity DataIC50:  4.30nM. Assay description: Binding affinity in competition with [3H]- CTOP in Opioid receptor mu 1 binding to rat brain membrane
In DepthDetails ArticlePubMed