BDBM50020512 6-Methoxy-1,2,3,4-tetrahydro-naphthalen-2-ylamine::CHEMBL99215
SMILES COc1ccc2CC(N)CCc2c1
InChI Key InChIKey=WASIYUSITZITPW-UHFFFAOYSA-N
Data  2 KI
  Tab Delimited (TSV)   2D SDfile   Computed 3D by Vconf -m prep SDfile
Find this compound or compounds like it in BindingDB:
Activity Spreadsheet -- Enzyme Inhibition Constant Data from BindingDB
Found 2 hits for monomerid = 50020512
TargetPhenylethanolamine N-methyltransferase(Bos taurus (bovine))
University Of Kansas
Curated by ChEMBL
LigandPNGBDBM50020512(6-Methoxy-1,2,3,4-tetrahydro-naphthalen-2-ylamine ...)
Affinity DataKi:  3.40E+4nM. Assay description: In vitro inhibitory activity against bovine phenylethanolamine N-methyl-transferase
In DepthDetails ArticlePubMed
TargetMelatonin receptor type 1A/1B/1C(Gallus gallus)
University Of Groningen
Curated by ChEMBL
LigandPNGBDBM50020512(6-Methoxy-1,2,3,4-tetrahydro-naphthalen-2-ylamine ...)
Affinity DataKi: >1.00E+5nM. Assay description: Binding affinity to compete for 2-[125I]iodomelatonin binding to chicken retinal membranes
In DepthDetails ArticlePubMed