BDBM50020581 2-Iodo-4-{2-[4-(3-trifluoromethyl-phenyl)-piperazin-1-yl]-ethyl}-phenylamine::CHEMBL153174
SMILES Nc1ccc(CCN2CCN(CC2)c2cccc(c2)C(F)(F)F)cc1I
InChI Key InChIKey=SRQUFBCRUHYBHN-UHFFFAOYSA-N
Data  2 KI  2 IC50
  Tab Delimited (TSV)   2D SDfile   Computed 3D by Vconf -m prep SDfile
Find this compound or compounds like it in BindingDB:
Activity Spreadsheet -- Enzyme Inhibition Constant Data from BindingDB
Found 4 hits for monomerid = 50020581
Target5-hydroxytryptamine receptor 1A(Homo sapiens (Human))
University Of Pennsylvania
Curated by ChEMBL
LigandPNGBDBM50020581(2-Iodo-4-{2-[4-(3-trifluoromethyl-phenyl)-piperazi...)
Affinity DataKi:  19nM. Assay description: Compound was tested in vitro for the inhibition of [3H]-5-HT (2 nM) binding to 5-hydroxytryptamine 1A receptor from bovine hippocampus
In DepthDetails ArticlePubMed
Target5-hydroxytryptamine receptor 1A(Homo sapiens (Human))
University Of Pennsylvania
Curated by ChEMBL
LigandPNGBDBM50020581(2-Iodo-4-{2-[4-(3-trifluoromethyl-phenyl)-piperazi...)
Affinity DataKi:  20nM. Assay description: Compound was tested in vitro for the inhibition of [3H]-5-HT (2 nM) binding to 5-HT1A receptor from bovine hippocampus
In DepthDetails ArticlePubMed
Target5-hydroxytryptamine receptor 1A(Homo sapiens (Human))
University Of Pennsylvania
Curated by ChEMBL
LigandPNGBDBM50020581(2-Iodo-4-{2-[4-(3-trifluoromethyl-phenyl)-piperazi...)
Affinity DataIC50:  40nM. Assay description: Compound was tested in vitro for the inhibition of [3H]-5-HT (2 nM) binding to 5-hydroxytryptamine 1A receptor from bovine hippocampus
In DepthDetails ArticlePubMed
Target5-hydroxytryptamine receptor 1A(Homo sapiens (Human))
University Of Pennsylvania
Curated by ChEMBL
LigandPNGBDBM50020581(2-Iodo-4-{2-[4-(3-trifluoromethyl-phenyl)-piperazi...)
Affinity DataIC50:  38nM. Assay description: Compound was tested in vitro for the inhibition of [3H]-DPAT (1 nM) binding to 5-HT1A receptor from bovine hippocampus
In DepthDetails ArticlePubMed