BDBM50021006 1,3-Dimethyl-8-o-tolyl-3,7-dihydro-purine-2,6-dione::CHEMBL10937
SMILES Cc1ccccc1-c1nc2n(C)c(=O)n(C)c(=O)c2[nH]1
InChI Key InChIKey=NVWRIJAHXFWOBU-UHFFFAOYSA-N
Data  1 KI  1 IC50
  Tab Delimited (TSV)   2D SDfile   Computed 3D by Vconf -m prep SDfile
Find this compound or compounds like it in BindingDB:
Activity Spreadsheet -- Enzyme Inhibition Constant Data from BindingDB
Found 2 hits for monomerid = 50021006
TargetAdenosine receptor A1(Rattus norvegicus (rat))
Center For Bio-Pharmaceutical Sciences
Curated by ChEMBL
LigandPNGBDBM50021006(1,3-Dimethyl-8-o-tolyl-3,7-dihydro-purine-2,6-dion...)
Affinity DataKi:  3.60nM. Assay description: Evaluated for binding affinity against Adenosine A1 receptorChecked by Author
In DepthDetails ArticlePubMed
TargetAdenosine receptor A1(BOVINE)
TBA
Curated by ChEMBL
LigandPNGBDBM50021006(1,3-Dimethyl-8-o-tolyl-3,7-dihydro-purine-2,6-dion...)
Affinity DataIC50:  6.5nM. Assay description: Binding affinity against bovine brain adenosine A1 receptor by using N6-[3H]- cyclohexyladenosineChecked by Author
In DepthDetails ArticlePubMed