BDBM50021032 CHEMBL281394::N-[[(Acetylamino)methyl]hydroxyphosphinyl]phenylalanylmethionine, disodium salt
SMILES CSCCC(NC(Cc1ccccc1)NP([O-])(=O)CNC(C)=O)C(O)=O
InChI Key InChIKey=LSJZGSZCTRYSAJ-UHFFFAOYSA-M
Data  2 KI
  Tab Delimited (TSV)   2D SDfile   Computed 3D by Vconf -m prep SDfile
Find this compound or compounds like it in BindingDB:
Activity Spreadsheet -- Enzyme Inhibition Constant Data from BindingDB
Found 2 hits for monomerid = 50021032
TargetNeprilysin(Rattus norvegicus (Rat))
TBA
Curated by ChEMBL
LigandPNGBDBM50021032(CHEMBL281394 | N-[[(Acetylamino)methyl]hydroxyphos...)
Affinity DataKi:  140nM. Assay description: Binding affinity towards enkephalinase (metalloendopeptidase, E.C.3.4.24.11) of rat kidney
In DepthDetails ArticlePubMed
TargetAngiotensin-converting enzyme 2(Rattus norvegicus)
TBA
Curated by ChEMBL
LigandPNGBDBM50021032(CHEMBL281394 | N-[[(Acetylamino)methyl]hydroxyphos...)
Affinity DataKi:  3.40E+3nM. Assay description: Binding affinity towards Angiotensin I converting enzyme of rat brain IgG immobilized enzyme.
In DepthDetails ArticlePubMed