BDBM50021033 CHEMBL429227::N-[[[(Tyrosyl-D-alanyl)amino]methyl]hydroxyphosphinyl]phenylalanylleucine, disodium salt
SMILES CC(C)CC(NC(Cc1ccccc1)NP([O-])(=O)CNC(=O)[C@H](C)NC(=O)C(N)Cc1ccc(O)cc1)C(O)=O
InChI Key InChIKey=AOCUMFHSTDKTQQ-PJNRRBRMSA-M
Data  2 KI
  Tab Delimited (TSV)   2D SDfile   Computed 3D by Vconf -m prep SDfile
Find this compound or compounds like it in BindingDB:
Activity Spreadsheet -- Enzyme Inhibition Constant Data from BindingDB
Found 2 hits for monomerid = 50021033
TargetNeprilysin(Rattus norvegicus (Rat))
TBA
Curated by ChEMBL
LigandPNGBDBM50021033(CHEMBL429227 | N-[[[(Tyrosyl-D-alanyl)amino]methyl...)
Affinity DataKi:  280nM. Assay description: Binding affinity towards enkephalinase (metalloendopeptidase, E.C.3.4.24.11) of human
In DepthDetails ArticlePubMed
TargetAngiotensin-converting enzyme 2(Rattus norvegicus)
TBA
Curated by ChEMBL
LigandPNGBDBM50021033(CHEMBL429227 | N-[[[(Tyrosyl-D-alanyl)amino]methyl...)
Affinity DataKi:  2.80E+3nM. Assay description: Binding affinity towards Angiotensin I converting enzyme of rat brain IgG immobilized enzyme.
In DepthDetails ArticlePubMed