BDBM50021270 2-(1-Carboxymethyl-2-oxo-pyrrolidin-3-ylamino)-4-phenyl-butyric acid::CHEMBL86891
SMILES OC(=O)CN1CCC(NC(CCc2ccccc2)C(O)=O)C1=O
InChI Key InChIKey=GIJLWESQACPTDV-UHFFFAOYSA-N
Data  2 IC50
  Tab Delimited (TSV)   2D SDfile   Computed 3D by Vconf -m prep SDfile
Find this compound or compounds like it in BindingDB:
Activity Spreadsheet -- Enzyme Inhibition Constant Data from BindingDB
Found 2 hits for monomerid = 50021270
TargetAngiotensin-converting enzyme(Homo sapiens (Human))
TBA
Curated by ChEMBL
LigandPNGBDBM50021270(2-(1-Carboxymethyl-2-oxo-pyrrolidin-3-ylamino)-4-p...)
Affinity DataIC50:  1.90E+4nM. Assay description: Inhibitory concentration (isomer B) against Angiotensin I converting enzyme
In DepthDetails ArticlePubMed
TargetAngiotensin-converting enzyme(Homo sapiens (Human))
TBA
Curated by ChEMBL
LigandPNGBDBM50021270(2-(1-Carboxymethyl-2-oxo-pyrrolidin-3-ylamino)-4-p...)
Affinity DataIC50:  1.90E+4nM. Assay description: Inhibitory concentration (isomer B) against Angiotensin I converting enzyme
In DepthDetails ArticlePubMed