BDBM50021422 2,6,6-Trimethyl-bicyclo[3.1.1]heptane-3-carboxylic acid 1,4-dimethyl-piperidin-4-yl ester::CHEMBL38063
SMILES CC1C2CC(CC1C(=O)OC1(C)CCN(C)CC1)C2(C)C
InChI Key InChIKey=RVLXUGUJUHMONL-UHFFFAOYSA-N
Data  2 IC50
  Tab Delimited (TSV)   2D SDfile   Computed 3D by Vconf -m prep SDfile
Find this compound or compounds like it in BindingDB:
Activity Spreadsheet -- Enzyme Inhibition Constant Data from BindingDB
Found 2 hits for monomerid = 50021422
TargetSodium channel protein type 1/2/3 subunit alpha(Homo sapiens (Human))
TBA
Curated by ChEMBL
LigandPNGBDBM50021422(2,6,6-Trimethyl-bicyclo[3.1.1]heptane-3-carboxylic...)
Affinity DataIC50:  3.00E+3nM. Assay description: Inhibition of [3H]-BTX binding to guinea pig voltage-dependent sodium channel
In DepthDetails ArticlePubMed
TargetSodium channel protein type 1/2/3 subunit alpha(Homo sapiens (Human))
TBA
Curated by ChEMBL
LigandPNGBDBM50021422(2,6,6-Trimethyl-bicyclo[3.1.1]heptane-3-carboxylic...)
Affinity DataIC50:  3.00E+3nM. Assay description: Inhibition of [3H]-BTX binding to guinea pig voltage-dependent sodium channel
In DepthDetails ArticlePubMed