BDBM50021434 2-Benzoyl-benzoic acid 1-methyl-piperidin-4-yl ester::CHEMBL36830
SMILES CN1CCC(CC1)OC(=O)c1ccccc1C(=O)c1ccccc1
InChI Key InChIKey=UTDHSARTTXPDQD-UHFFFAOYSA-N
Data  1 IC50
  Tab Delimited (TSV)   2D SDfile   Computed 3D by Vconf -m prep SDfile
Find this compound or compounds like it in BindingDB:
Activity Spreadsheet -- Enzyme Inhibition Constant Data from BindingDB
Found 1 hit for monomerid = 50021434
TargetSodium channel protein type 1/2/3 subunit alpha(Homo sapiens (Human))
TBA
Curated by ChEMBL
LigandPNGBDBM50021434(2-Benzoyl-benzoic acid 1-methyl-piperidin-4-yl est...)
Affinity DataIC50: >1.00E+4nM. Assay description: Inhibition of [3H]-BTX binding to guinea pig voltage-dependent sodium channel
In DepthDetails ArticlePubMed