BDBM50021436 2-Phenethyl-benzoic acid 3-diethylamino-propyl ester::CHEMBL288030
SMILES CCN(CC)CCCOC(=O)c1ccccc1CCc1ccccc1
InChI Key InChIKey=PXMVXGSLAXPCIQ-UHFFFAOYSA-N
Data  1 IC50
  Tab Delimited (TSV)   2D SDfile   Computed 3D by Vconf -m prep SDfile
Find this compound or compounds like it in BindingDB:
Activity Spreadsheet -- Enzyme Inhibition Constant Data from BindingDB
Found 1 hit for monomerid = 50021436
TargetSodium channel protein type 1/2/3 subunit alpha(Homo sapiens (Human))
TBA
Curated by ChEMBL
LigandPNGBDBM50021436(2-Phenethyl-benzoic acid 3-diethylamino-propyl est...)
Affinity DataIC50:  6.00E+3nM. Assay description: Inhibition of [3H]-BTX binding to guinea pig voltage-dependent sodium channel
In DepthDetails ArticlePubMed