BDBM50021441 2-Phenethyl-benzoic acid 1,4-dimethyl-piperidin-4-yl ester::CHEMBL36889
SMILES CN1CCC(C)(CC1)OC(=O)c1ccccc1CCc1ccccc1
InChI Key InChIKey=MHHQIBXVGQSIKD-UHFFFAOYSA-N
Data  1 IC50
  Tab Delimited (TSV)   2D SDfile   Computed 3D by Vconf -m prep SDfile
Find this compound or compounds like it in BindingDB:
Activity Spreadsheet -- Enzyme Inhibition Constant Data from BindingDB
Found 1 hit for monomerid = 50021441
TargetSodium channel protein type 1/2/3 subunit alpha(Homo sapiens (Human))
TBA
Curated by ChEMBL
LigandPNGBDBM50021441(2-Phenethyl-benzoic acid 1,4-dimethyl-piperidin-4-...)
Affinity DataIC50:  3.20E+3nM. Assay description: Inhibition of [3H]-BTX binding to guinea pig voltage-dependent sodium channel
In DepthDetails ArticlePubMed