BDBM50021899 9-Chloro-6-(4-chloro-phenyl)-1,2,3,5,6,10b-hexahydro-pyrrolo[2,1-a]isoquinoline;C7H8O3S::CHEMBL32270
SMILES Clc1ccc(cc1)[C@@H]1CN2CCC[C@H]2c2cc(Cl)ccc12
InChI Key InChIKey=AYPHLNYJPXDWTG-ROUUACIJSA-N
Data  3 KI
  Tab Delimited (TSV)   2D SDfile   Computed 3D by Vconf -m prep SDfile
Find this compound or compounds like it in BindingDB:
Activity Spreadsheet -- Enzyme Inhibition Constant Data from BindingDB
Found 3 hits for monomerid = 50021899
TargetTransporter(Rattus norvegicus)
TBA
Curated by ChEMBL
LigandPNGBDBM50021899(9-Chloro-6-(4-chloro-phenyl)-1,2,3,5,6,10b-hexahyd...)
Affinity DataKi:  34nM. Assay description: Inhibition of uptake of tritiated norepinephrine (NE) in rat synaptosomes
In DepthDetails ArticlePubMed
TargetSodium-dependent dopamine transporter(Rattus norvegicus (rat))
TBA
Curated by ChEMBL
LigandPNGBDBM50021899(9-Chloro-6-(4-chloro-phenyl)-1,2,3,5,6,10b-hexahyd...)
Affinity DataKi:  65nM. Assay description: Inhibition of the uptake of tritiated dopamine (DA) in rat synaptosomes
In DepthDetails ArticlePubMed
TargetSodium-dependent serotonin transporter(Rattus norvegicus (rat))
TBA
Curated by ChEMBL
LigandPNGBDBM50021899(9-Chloro-6-(4-chloro-phenyl)-1,2,3,5,6,10b-hexahyd...)
Affinity DataKi:  234nM. Assay description: Inhibition the uptake of tritiated serotonin (5-HT) by the serotonin transporter SERT in rat synaptosomes
In DepthDetails ArticlePubMed