BDBM50021926 CHEMBL3298598
SMILES [I-].C[N+]12CCC(CC1)[C@H](C2)OC(=O)Nc1ncsc1-c1cccc(Cl)c1
InChI Key InChIKey=DMYMHWZDYNBJLD-CUTBRAQKSA-N
Data  3 KI
  Tab Delimited (TSV)   2D SDfile   Computed 3D by Vconf -m prep SDfile
Find this compound or compounds like it in BindingDB:
Activity Spreadsheet -- Enzyme Inhibition Constant Data from BindingDB
Found 3 hits for monomerid = 50021926
TargetMuscarinic acetylcholine receptor M3(RAT)
Astellas Pharma
Curated by ChEMBL
LigandPNGBDBM50021926(CHEMBL3298598)
Affinity DataKi:  0.25nM. Assay description: Displacement of [3H]-NMS from Sprague-Dawley rat muscarinic M3 receptor in submandibular gland
In DepthDetails ArticlePubMed
TargetMuscarinic acetylcholine receptor M1(RAT)
Astellas Pharma
Curated by ChEMBL
LigandPNGBDBM50021926(CHEMBL3298598)
Affinity DataKi:  0.310nM. Assay description: Displacement of [3H]-NMS from Sprague-Dawley rat muscarinic M1 receptor in cortex membrane
In DepthDetails ArticlePubMed
TargetMuscarinic acetylcholine receptor M2(RAT)
Astellas Pharma
Curated by ChEMBL
LigandPNGBDBM50021926(CHEMBL3298598)
Affinity DataKi:  1.20nM. Assay description: Displacement of [3H]-NMS from Sprague-Dawley rat muscarinic M2 receptor in heart
In DepthDetails ArticlePubMed