BDBM50022175 (2-Oxo-2H-chromen-4-yl)-acetic acid::CHEMBL274190
SMILES OC(=O)Cc1cc(=O)oc2ccccc12
InChI Key InChIKey=PBCQXKZFPXBUSL-UHFFFAOYSA-N
Data  1 IC50
  Tab Delimited (TSV)   2D SDfile   Computed 3D by Vconf -m prep SDfile
Find this compound or compounds like it in BindingDB:
Activity Spreadsheet -- Enzyme Inhibition Constant Data from BindingDB
Found 1 hit for monomerid = 50022175
TargetAldo-keto reductase family 1 member B1(Rattus norvegicus)
TBA
Curated by ChEMBL
LigandPNGBDBM50022175((2-Oxo-2H-chromen-4-yl)-acetic acid | CHEMBL274190)
Affinity DataIC50:  600nM. Assay description: Compound was tested for inhibitory concentration against rat lens aldose reductase (uncompetitive inhibition type)
In DepthDetails ArticlePubMed