BDBM50022287 8-Acetylamino-3-hydroxy-4-{3-methyl-2-[3-methyl-2-(3-methyl-butyrylamino)-butyrylamino]-butyrylamino}-octanoic acid ethyl ester::CHEMBL98552
SMILES CCOC(=O)C[C@H](O)[C@H](CCCCNC(C)=O)NC(=O)[C@H](NC(=O)C(NC(=O)CC(C)C)C(C)C)C(C)C
InChI Key InChIKey=VOLSVJOGWHOTLO-AAXRKXIRSA-N
Data  2 KI
  Tab Delimited (TSV)   2D SDfile   Computed 3D by Vconf -m prep SDfile
Find this compound or compounds like it in BindingDB:
Activity Spreadsheet -- Enzyme Inhibition Constant Data from BindingDB
Found 2 hits for monomerid = 50022287
TargetRhizopuspepsin(Rhizopus microsporus var. chinensis)
TBA
Curated by ChEMBL
LigandPNGBDBM50022287(8-Acetylamino-3-hydroxy-4-{3-methyl-2-[3-methyl-2-...)
Affinity DataKi:  29nM. Assay description: Inhibition of R. chinensis pepsin
In DepthDetails ArticlePubMed
TargetPepsin A(Porcine)
TBA
Curated by ChEMBL
LigandPNGBDBM50022287(8-Acetylamino-3-hydroxy-4-{3-methyl-2-[3-methyl-2-...)
Affinity DataKi:  1.90E+3nM. Assay description: Compound was evaluated for the inhibition of porcine pepsin
In DepthDetails ArticlePubMed