BDBM50022609 CHEMBL3142282::{1-[1-(1-Cyclohexylmethyl-2-hydroxy-5-methyl-hexylcarbamoyl)-ethylcarbamoyl]-2-phenyl-ethyl}-carbamic acid tert-butyl ester
SMILES CC(C)CC[C@H](O)[C@H](CC1CCCCC1)NC(=O)[C@H](C)NC(=O)[C@H](Cc1ccccc1)NC(=O)OC(C)(C)C
InChI Key InChIKey=XCDONWZWXBVHNA-FEZNKAMESA-N
Data  1 IC50
  Tab Delimited (TSV)   2D SDfile   Computed 3D by Vconf -m prep SDfile
Find this compound or compounds like it in BindingDB:
Activity Spreadsheet -- Enzyme Inhibition Constant Data from BindingDB
Found 1 hit for monomerid = 50022609
TargetRenin(Homo sapiens (Human))
Abbott Laboratories
Curated by ChEMBL
LigandPNGBDBM50022609(CHEMBL3142282 | {1-[1-(1-Cyclohexylmethyl-2-hydrox...)
Affinity DataIC50:  200nM. Assay description: In vitro inhibitory activity of the compound against renin
In DepthDetails ArticlePubMed