BDBM50022612 (1-{1-[1-(1,2-Dihydroxy-ethyl)-3-methyl-butylcarbamoyl]-ethylcarbamoyl}-2-phenyl-ethyl)-carbamic acid tert-butyl ester::CHEMBL3142296
SMILES CC(C)C[C@H](NC(=O)[C@H](C)NC(=O)[C@H](Cc1ccccc1)NC(=O)OC(C)(C)C)[C@@H](O)CO
InChI Key InChIKey=IBPJLRLFYIMNTA-YSNUMNBNSA-N
Data  1 IC50
  Tab Delimited (TSV)   2D SDfile   Computed 3D by Vconf -m prep SDfile
Find this compound or compounds like it in BindingDB:
Activity Spreadsheet -- Enzyme Inhibition Constant Data from BindingDB
Found 1 hit for monomerid = 50022612
TargetRenin(Homo sapiens (Human))
Abbott Laboratories
Curated by ChEMBL
LigandPNGBDBM50022612((1-{1-[1-(1,2-Dihydroxy-ethyl)-3-methyl-butylcarba...)
Affinity DataIC50:  4.00E+3nM. Assay description: In vitro inhibitory activity of the compound against renin
In DepthDetails ArticlePubMed