BDBM50022627 CHEMBL3142272::{1-[1-(2-Cyclohexyl-1-hydroxymethyl-ethylcarbamoyl)-ethylcarbamoyl]-2-phenyl-ethyl}-carbamic acid tert-butyl ester
SMILES C[C@H](NC(=O)[C@H](Cc1ccccc1)NC(=O)OC(C)(C)C)C(=O)N[C@H](CO)CC1CCCCC1
InChI Key InChIKey=RDDQNTHNSQSBAC-UHFFFAOYSA-N
Data  1 IC50
  Tab Delimited (TSV)   2D SDfile   Computed 3D by Vconf -m prep SDfile
Find this compound or compounds like it in BindingDB:
Activity Spreadsheet -- Enzyme Inhibition Constant Data from BindingDB
Found 1 hit for monomerid = 50022627
TargetRenin(Homo sapiens (Human))
Abbott Laboratories
Curated by ChEMBL
LigandPNGBDBM50022627(CHEMBL3142272 | {1-[1-(2-Cyclohexyl-1-hydroxymethy...)
Affinity DataIC50:  4.00E+3nM. Assay description: In vitro inhibitory activity of the compound against renin
In DepthDetails ArticlePubMed