BDBM50022636 CHEMBL3142269::{1-[1-(1-Cyclohexylmethyl-2,3-dihydroxy-pentylcarbamoyl)-3-methyl-butylcarbamoyl]-2-phenyl-ethyl}-carbamic acid ethyl ester
SMILES CCOC(=O)N[C@@H](Cc1ccccc1)C(=O)N[C@@H](CC(C)C)C(=O)N[C@@H](CC1CCCCC1)[C@@H](O)[C@@H](O)CC
InChI Key InChIKey=GLVMEDLGIQJVEO-DDYVRPDDSA-N
Data  1 IC50
  Tab Delimited (TSV)   2D SDfile   Computed 3D by Vconf -m prep SDfile
Find this compound or compounds like it in BindingDB:
Activity Spreadsheet -- Enzyme Inhibition Constant Data from BindingDB
Found 1 hit for monomerid = 50022636
TargetRenin(Homo sapiens (Human))
Abbott Laboratories
Curated by ChEMBL
LigandPNGBDBM50022636(CHEMBL3142269 | {1-[1-(1-Cyclohexylmethyl-2,3-dihy...)
Affinity DataIC50:  1.10nM. Assay description: In vitro inhibitory activity was tested against purified human renal renin
In DepthDetails ArticlePubMed