BDBM50022673 (5-(3,4-dichlorophenyl)-2,3-dihydro-1H-pyrrolizine-6,7-diyl)bis(methylene) bis(isopropylcarbamate)::CHEMBL284134::Isopropyl-carbamic acid 3-(3,4-dichloro-phenyl)-2-isopropylcarbamoyloxymethyl-2,5,6,7-tetrahydro-pyrrolizin-1-ylmethyl ester::Isopropyl-carbamic acid 3-(3,4-dichloro-phenyl)-2-isopropylcarbamoyloxymethyl-6,7-dihydro-5H-pyrrolizin-1-ylmethyl ester::NSC-278214
SMILES CC(C)NC(=O)OCc1c(COC(=O)NC(C)C)c(-c2ccc(Cl)c(Cl)c2)n2CCCc12
InChI Key InChIKey=CCBHSPUYWZHDFX-UHFFFAOYSA-N
Data  1 IC50
  Tab Delimited (TSV)   2D SDfile   Computed 3D by Vconf -m prep SDfile
Find this compound or compounds like it in BindingDB:
Activity Spreadsheet -- Enzyme Inhibition Constant Data from BindingDB
Found 1 hit for monomerid = 50022673
TargetCytochrome P450 2D6(Homo sapiens (Human))
University Of Leicester
Curated by ChEMBL
LigandPNGBDBM50022673((5-(3,4-dichlorophenyl)-2,3-dihydro-1H-pyrrolizine...)
Affinity DataIC50:  1.10E+4nM. Assay description: Inhibitory concentration against cytochrome P450 2D6
In DepthDetails ArticlePubMed