BDBM50022881 1N-[1-[2,2-dicyclohexyl-1-formyl-(1S)-ethylcarbamoyl]-(1S)-ethyl]-2-aminotertiarybutyloxycarbonyl-3-phenyl-(2S)-propanamide::CHEMBL151055
SMILES C[C@H](NC(=O)[C@H](Cc1ccccc1)NC(=O)OC(C)(C)C)C(=O)N[C@H](C=O)C(C1CCCCC1)C1CCCCC1
InChI Key InChIKey=XTKOQUHOYSCWCV-WDDWZANVSA-N
Data  1 IC50
  Tab Delimited (TSV)   2D SDfile   Computed 3D by Vconf -m prep SDfile
Find this compound or compounds like it in BindingDB:
Activity Spreadsheet -- Enzyme Inhibition Constant Data from BindingDB
Found 1 hit for monomerid = 50022881
TargetRenin(Homo sapiens (Human))
Abbott Laboratories
Curated by ChEMBL
LigandPNGBDBM50022881(1N-[1-[2,2-dicyclohexyl-1-formyl-(1S)-ethylcarbamo...)
Affinity DataIC50:  4.00E+4nMpH: 6.0Assay Description:Inhibition of human renal renin at pH 6
In DepthDetails ArticlePubMed