BDBM50022971 CHEMBL284701::Pro-Phe-His-Statine-Ile-Phe-NH2
SMILES CC[C@H](C)[C@H](NC(=O)CC(O)C(CC(C)C)NC(=O)[C@H](Cc1cnc[nH]1)NC(=O)[C@H](Cc1ccccc1)NC(=O)[C@@H]1CCCN1)C(=O)NC(=O)[C@@H](N)Cc1ccccc1
InChI Key InChIKey=CXPVMEQWLSMBDT-JAIGLRJXSA-N
Data  1 IC50
  Tab Delimited (TSV)   2D SDfile   Computed 3D by Vconf -m prep SDfile
Find this compound or compounds like it in BindingDB:
Activity Spreadsheet -- Enzyme Inhibition Constant Data from BindingDB
Found 1 hit for monomerid = 50022971
TargetRenin(Homo sapiens (Human))
TBA
Curated by ChEMBL
LigandPNGBDBM50022971(CHEMBL284701 | Pro-Phe-His-Statine-Ile-Phe-NH2)
Affinity DataIC50:  220nM. Assay description: Inhibitory activity against human plasma renin
In DepthDetails ArticlePubMed