BDBM50022979 CHEMBL286958::Pro-Phe-His-Statine-NH2
SMILES CC(C)CC(NC(=O)[C@H](Cc1cnc[nH]1)NC(=O)[C@H](Cc1ccccc1)NC(=O)[C@@H]1CCCN1)C(O)CC(N)=O
InChI Key InChIKey=INIPXLSQVATMRA-WKCARCATSA-N
Data  1 IC50
  Tab Delimited (TSV)   2D SDfile   Computed 3D by Vconf -m prep SDfile
Find this compound or compounds like it in BindingDB:
Activity Spreadsheet -- Enzyme Inhibition Constant Data from BindingDB
Found 1 hit for monomerid = 50022979
TargetRenin(Homo sapiens (Human))
TBA
Curated by ChEMBL
LigandPNGBDBM50022979(CHEMBL286958 | Pro-Phe-His-Statine-NH2)
Affinity DataIC50:  6.80E+4nM. Assay description: Inhibitory activity against human plasma renin
In DepthDetails ArticlePubMed