BDBM50022990 CHEMBL406168::His-Pro-Phe-His-Statine-Val-Tyr-Lys
SMILES CC(C)CC(NC(=O)[C@H](Cc1cnc[nH]1)NC(=O)[C@H](Cc1ccccc1)NC(=O)[C@@H]1CCCN1C(=O)[C@@H](N)Cc1cnc[nH]1)C(O)CC(=O)N[C@@H](C(C)C)C(=O)N[C@@H](Cc1ccc(O)cc1)C(=O)N[C@@H](CCCCN)C(O)=O
InChI Key InChIKey=LHCVHFYYHVHLKH-IMSQBHOQSA-N
Data  1 IC50
  Tab Delimited (TSV)   2D SDfile   Computed 3D by Vconf -m prep SDfile
Find this compound or compounds like it in BindingDB:
Activity Spreadsheet -- Enzyme Inhibition Constant Data from BindingDB
Found 1 hit for monomerid = 50022990
TargetRenin(Homo sapiens (Human))
TBA
Curated by ChEMBL
LigandPNGBDBM50022990(CHEMBL406168 | His-Pro-Phe-His-Statine-Val-Tyr-Lys)
Affinity DataIC50:  400nM. Assay description: Inhibitory activity against human plasma renin
In DepthDetails ArticlePubMed