BDBM50022995 CHEMBL2371849::Pro-His-Pro-Phe-His-StatineNH2
SMILES CC(C)C[C@H](NC(=O)[C@H](Cc1c[nH]cn1)NC(=O)[C@H](Cc1ccccc1)NC(=O)[C@@H]1CCCN1C(=O)[C@H](Cc1c[nH]cn1)NC(=O)[C@@H]1CCCN1)[C@@H](O)CC(N)=O
InChI Key InChIKey=VJSDDODVYCLGDV-MRNVWEPHSA-N
Data  1 IC50
  Tab Delimited (TSV)   2D SDfile   Computed 3D by Vconf -m prep SDfile
Find this compound or compounds like it in BindingDB:
Activity Spreadsheet -- Enzyme Inhibition Constant Data from BindingDB
Found 1 hit for monomerid = 50022995
TargetRenin(Homo sapiens (Human))
TBA
Curated by ChEMBL
LigandPNGBDBM50022995(CHEMBL2371849 | Pro-His-Pro-Phe-His-StatineNH2)
Affinity DataIC50:  900nM. Assay description: Inhibitory activity against human plasma renin
In DepthDetails ArticlePubMed