BDBM50023047 CHEMBL3144118::{1-[1-[1-(1-Hydroxy-2-isopropylsulfanyl-ethyl)-3-methyl-butylcarbamoyl]-2-(1H-imidazol-4-yl)-ethylcarbamoyl]-2-phenyl-ethyl}-carbamic acid tert-butyl ester
SMILES CC(C)C[C@@H](NC(=O)[C@H](Cc1c[nH]cn1)NC(=O)[C@H](Cc1ccccc1)NC(=O)OC(C)(C)C)[C@H](O)CSC(C)C
InChI Key InChIKey=HOMIXIGBHXBJNJ-ZMVDSDSOSA-N
Data  1 IC50
  Tab Delimited (TSV)   2D SDfile   Computed 3D by Vconf -m prep SDfile
Find this compound or compounds like it in BindingDB:
Activity Spreadsheet -- Enzyme Inhibition Constant Data from BindingDB
Found 1 hit for monomerid = 50023047
TargetRenin(Homo sapiens (Human))
TBA
Curated by ChEMBL
LigandPNGBDBM50023047(CHEMBL3144118 | {1-[1-[1-(1-Hydroxy-2-isopropylsul...)
Affinity DataIC50:  81nM. Assay description: Inhibition of human renal renin at the pH optimum 6.0.
In DepthDetails ArticlePubMed