BDBM50023050 CHEMBL40928::{1-[1-(1-{2-[1-(1-Carbamoyl-2-phenyl-ethylcarbamoyl)-3-methyl-butylcarbamoyl]-1-hydroxy-ethyl}-3-methyl-butylcarbamoyl)-2-phenyl-ethylcarbamoyl]-2-phenyl-ethyl}-carbamic acid tert-butyl ester
SMILES CC(C)C[C@H](NC(=O)[C@H](Cc1ccccc1)NC(=O)[C@H](Cc1ccccc1)NC(=O)OC(C)(C)C)[C@@H](O)CC(=O)N[C@@H](CC(C)C)C(=O)N[C@@H](Cc1ccccc1)C(N)=O
InChI Key InChIKey=QLMUILQZOPYXCJ-BGBFCPIGSA-N
Data  2 KI
  Tab Delimited (TSV)   2D SDfile   Computed 3D by Vconf -m prep SDfile
Find this compound or compounds like it in BindingDB:
Activity Spreadsheet -- Enzyme Inhibition Constant Data from BindingDB
Found 2 hits for monomerid = 50023050
TargetRenin(Homo sapiens (Human))
TBA
Curated by ChEMBL
LigandPNGBDBM50023050(CHEMBL40928 | {1-[1-(1-{2-[1-(1-Carbamoyl-2-phenyl...)
Affinity DataKi:  4.80nM. Assay description: Compound was tested for inhibition of human kidney renin
In DepthDetails ArticlePubMed
TargetRenin(Homo sapiens (Human))
TBA
Curated by ChEMBL
LigandPNGBDBM50023050(CHEMBL40928 | {1-[1-(1-{2-[1-(1-Carbamoyl-2-phenyl...)
Affinity DataKi:  52nM. Assay description: Compound was evaluated for inhibitory activity against human kidney renin
In DepthDetails ArticlePubMed