BDBM50023054 CHEMBL291091::{1-[1-(1-{2-[1-(1-Carbamoyl-2-phenyl-ethylcarbamoyl)-3-methyl-butylcarbamoyl]-2,2-difluoro-acetyl}-3-methyl-butylcarbamoyl)-2-phenyl-ethylcarbamoyl]-2-phenyl-ethyl}-carbamic acid tert-butyl ester
SMILES CC(C)C[C@H](NC(=O)C(F)(F)C(=O)[C@H](CC(C)C)NC(=O)[C@H](Cc1ccccc1)NC(=O)[C@H](Cc1ccccc1)NC(=O)OC(C)(C)C)C(=O)N[C@@H](Cc1ccccc1)C(N)=O
InChI Key InChIKey=LFCLHNJIEBPDPJ-LTLCPEALSA-N
Data  1 KI
  Tab Delimited (TSV)   2D SDfile   Computed 3D by Vconf -m prep SDfile
Find this compound or compounds like it in BindingDB:
Activity Spreadsheet -- Enzyme Inhibition Constant Data from BindingDB
Found 1 hit for monomerid = 50023054
TargetRenin(Homo sapiens (Human))
TBA
Curated by ChEMBL
LigandPNGBDBM50023054(CHEMBL291091 | {1-[1-(1-{2-[1-(1-Carbamoyl-2-pheny...)
Affinity DataKi:  7nM. Assay description: Compound was evaluated for inhibitory activity against human kidney renin
In DepthDetails ArticlePubMed