BDBM50023089 Boc-Phe-His-Sta-Leu-p-chlorobenzylamide::CHEMBL301129
SMILES CC(C)CC(NC(=O)[C@H](Cc1cnc[nH]1)NC(=O)[C@H](Cc1ccccc1)NC(=O)OC(C)(C)C)C(O)CC(=O)N[C@@H](CC(C)C)C(=O)NCc1ccc(Cl)cc1
InChI Key InChIKey=PNZRYJNQFXMDNY-DMCQDZEQSA-N
Data  3 KI
  Tab Delimited (TSV)   2D SDfile   Computed 3D by Vconf -m prep SDfile
Find this compound or compounds like it in BindingDB:
Activity Spreadsheet -- Enzyme Inhibition Constant Data from BindingDB
Found 3 hits for monomerid = 50023089
TargetRenin(Homo sapiens (Human))
Merck Sharp & Dohme Research Laboratories
Curated by ChEMBL
LigandPNGBDBM50023089(Boc-Phe-His-Sta-Leu-p-chlorobenzylamide | CHEMBL30...)
Affinity DataKi:  50nM. Assay description: Inhibition of human plasma renin at 10e-9 M concentration
In DepthDetails ArticlePubMed
TargetRenin(Homo sapiens (Human))
Merck Sharp & Dohme Research Laboratories
Curated by ChEMBL
LigandPNGBDBM50023089(Boc-Phe-His-Sta-Leu-p-chlorobenzylamide | CHEMBL30...)
Affinity DataKi:  240nM. Assay description: Inhibition of purified human kidney renin, fluorometric assay using a synthetic tetradecapeptide renin substrate at 10e-9 M concentration
In DepthDetails ArticlePubMed
TargetRenin(Homo sapiens (Human))
Merck Sharp & Dohme Research Laboratories
Curated by ChEMBL
LigandPNGBDBM50023089(Boc-Phe-His-Sta-Leu-p-chlorobenzylamide | CHEMBL30...)
Affinity DataKi:  280nM. Assay description: Inhibition of purified human kidney renin, radioimmunoassay using the natural substrate partially pure angiotensinogen at 10e-9 M concentration
In DepthDetails ArticlePubMed